diskontering
type: Concept
preferred label: discounting @en
preferred label: diskonttaus @fi
source: Kielitoimiston sanakirja
broader: överförande av ägande
in scheme: conceptscheme
comment: ostaa t. myydä velkasitoumus siten, että korko vähennetään velkasummasta etukäteen
broader generic: överförande av ägande

överförande av ägande
preferred label: transfer of ownership @en
preferred label: omistuksen siirtäminen @fi
type: Concept
narrower: diskontering