kolhydrater
preferred label: carbohydrates @en
preferred label: hiilihydraatit @fi
type: Concept
narrower: pektiner

pektiner
broader: kolhydrater
preferred label: pektiinit @fi
preferred label: pectins @en
broader generic: kolhydrater
comment: pektiini: polysakkaridi, joka on kasvin solunseinän, erityisesti primaariseinän ja keskilamellin, rakenneaine; polysakkaridi: suurimolekyylinen hiilihydraatti, joka syntyy useista monosakkarideista
type: Concept
source: Biologian sanakirja
in scheme: conceptscheme