tipsande
preferred label: vinkkaus @fi
type: Concept
narrower: bokprat

bokprat
preferred label: kirjavinkkaus @fi
preferred label: book hints @en
broader generic: tipsande
in scheme: conceptscheme
comment: Kirjavinkkaus on lukemaanhoukutusmenetelmä, jossa kirjaston työntekijä, opettaja tai muu kirjallisuudesta innostunut ihminen kertoo ryhmälle valitsemistaan kirjoista.
type: Concept
broader: tipsande