punktlighet
preferred label: exactitude @en
preferred label: täsmällisyys @fi
type: Concept
related: precision

inre egenskaper
preferred label: internal qualities @en
preferred label: sisäiset ominaisuudet @fi
type: Concept
narrower: precision

precision
preferred label: accuracy @en
preferred label: tarkkuus @fi
broader: inre egenskaper
in scheme: conceptscheme
type: Concept
related: punktlighet
comment: 1) täsmällisyys, oikeellisuus, sopivuus; osuvuus; 2) selvyys, terävyys, selväpiirteisyys, -rajaisuus; 3) aseista, mittareista tms.: tarkkakäyntisyys, kyky toimia oikein; 4) aisteista, havainto- ja toimintakyvystä; 5) säntillisyys, ehdottomuus; 6) säästäväisyys, taloudellisuus; 7) perusteellisuus, seikkaperäisyys, yksityiskohtaisuus
broader generic: inre egenskaper
source: Suomen kielen perussanakirja