student organisations
preferred label: studentorganisationer @sv
preferred label: opiskelijajärjestöt @fi
type: Concept
narrower: students' clubs

students' clubs
preferred label: studentnationer @sv
preferred label: osakunnat @fi
broader generic: student organisations
in scheme: conceptscheme
source: Kielitoimiston sanakirja
broader: student organisations
comment: samasta maakunnasta kotoisin olevien yliopiston opiskelijoiden yhdistys
type: Concept