paikkatiedot
comment: paikannettua kohdetta kuvaavan sijaintitiedon ja kohteen ominaisuuksia kuvaavien tietojen muodostama kokonaisuus
broader: tieto
broader generic: tieto
preferred label: geografisk information @sv
preferred label: geographic information @en
source: Paikannussanasto TSK 30
type: Concept
in scheme: conceptscheme

tieto
preferred label: data @en
type: Concept
narrower: paikkatiedot