content of work
preferred label: arbetsinnehåll @sv
preferred label: työn sisältö @fi
type: Concept
broader generic: content
broader: content

other role
preferred label: muu rooli @fi
preferred label: annan roll @sv
type: Concept
narrower: content

content
preferred label: innehåll @sv
preferred label: sisältö @fi
comment: 1) se mikä on jonkin sisällä (erillisenä, esiin otettavana), sisällys; 2) jonkin ilmaisun, toiminnan tms. merkitys, mieli, olemus, vars. ulkonaisen muodon vastakohtana; sisällysluettelon otsikkona tavallisemmin: sisällys
broader: other role
in scheme: conceptscheme
type: Concept
broader generic: other role
narrower: content of work
source: Suomen kielen perussanakirja