computer viruses
preferred label: tietokonevirukset @fi
preferred label: datavirus @sv
type: Concept
broader generic: malware
broader: malware

malware
type: Concept
source: Tiivis tietoturvasanasto TSK 31
narrower: computer viruses
preferred label: haittaohjelmat @fi
preferred label: skadliga program @sv
in scheme: conceptscheme
broader generic: computer programmes
comment: ohjelma, ohjelman osa tai muu käskyjoukko, joka tarkoituksellisesti aiheuttaa ei-toivottuja tapahtumia tietojärjestelmässä tai sen osassa; Haittaohjelmia ovat esimerkiksi virukset ja madot sekä näiden yhdistelmät
broader: computer programmes

computer programmes
preferred label: dataprogram @sv
preferred label: atk-ohjelmat @fi
type: Concept
narrower: malware