loukkaantuminen (muutos)
alternative label: loukkaantuminen
broader: muutokset
source: Kielitoimiston sanakirja
comment: loukata, satuttaa itsensä, saada vamma, vammautua, vahingoittua
preferred label: being injured (change) @en
preferred label: fysisk skada (ådragande) @sv
in scheme: conceptscheme
broader generic: muutokset
type: Concept

muutokset
preferred label: förändringar @sv
preferred label: changes @en
type: Concept
narrower: loukkaantuminen (muutos)