warrantit (asiakirjat)
preferred label: warrants @en
preferred label: warranter (handlingar) @sv
source: Lähde: Taloussanasto
in scheme: conceptscheme
comment: Yleisen talletusmakasiinin antama talletustodistukseen liittyvä asiakirja, joka antaa haltijalleen panttioikeuden talletettuun tavaraan.
type: Concept
alternative label: warrantit
broader generic: asiakirjat
broader: asiakirjat

asiakirjat
preferred label: dokument, handlingar @sv
preferred label: documents @en
type: Concept
narrower: warrantit (asiakirjat)