matkailualueet
preferred label: turistområde @sv
preferred label: tourist areas @en
type: Concept
narrower: Metsäpeuran maa

Metsäpeuran maa
broader generic: matkailualueet
broader: matkailualueet
comment: Metsäpeuran maan luontomatkailu- ja metsätalouden esittelyalue, jossa esitellään yleisölle Suomenselän metsien monipuolista käyttöä eri aikoina.
in scheme: conceptscheme
type: Concept