semanttiset ilmiöt
type: Concept
narrower: metonymia

metonymia
type: Concept
comment: Metonymia on merkitysten vaihtoa ilman muodonmuutosta, kuten tapahtuu metaforassa.
source: http://www.saunalahti.fi/~etaopit/Teletopelius/lyriikka/lyriikka3b1.htm
broader generic: semanttiset ilmiöt
broader: semanttiset ilmiöt
preferred label: metonymy @en
preferred label: metonymi @sv
related: metafora
in scheme: conceptscheme

metafora
preferred label: metafor @sv
preferred label: metaphor @en
type: Concept
related: metonymia