korit (rakenne)
type: Concept
comment: rakenteista esim. hissin se osa, jossa kuljetetaan lastia
in scheme: conceptscheme
broader: konkreettinen eloton objekti
broader generic: konkreettinen eloton objekti
preferred label: baskets @en
preferred label: karosserier @sv
source: Suomen kielen perussanakirja

konkreettinen eloton objekti
preferred label: concrete inanimate object @en
preferred label: konkret icke-levande objekt @sv
type: Concept
narrower: korit (rakenne)