colonies, settlements
preferred label: kolonier (lokalsamhällen) @sv
preferred label: siirtokunnat @fi
type: Concept
narrower: Sointula

Sointula
type: Concept
broader: colonies, settlements
broader: communes
broader generic: communes
broader generic: colonies, settlements
in scheme: conceptscheme
comment: Matti Kurikan perustama sosialistinen siirtokunta Vancouverin lähellä sijaitsevalla Malcolm Islandin saarella 1900-luvun alussa; nykyään paikannimi

communes
preferred label: kommuner (kollektiv) @sv
preferred label: kommuunit @fi
type: Concept
narrower: Sointula