työ työn ehtojen mukaan
type: Collection
member: avotyö (vammaisten)

avotyö (vammaisten)
source: Lähde: Koivumäki, E. Työkeskukseen vai avoimille työmarkkinoille
broader generic: työ
comment: vammaisten henkilöiden huoltosuhteeseen perustuvaa työtä normaaleilla työpaikoilla
type: Concept
preferred label: open work @en
preferred label: öppet arbete (handikappade) @sv
alternative label: avotyö
in scheme: conceptscheme
note: Avotyö voi tarkoittaa kahta asiaa. 1) Avotyö on vammaisten henkilöiden huoltosuhteeseen perustuvaa työtä normaaleilla työpaikoilla. 2) Avotyö tarkoittaa lastensuojelun ja perhetukikeskusten piirissä tehtävää työtä
broader: työ

työ
preferred label: work @en
preferred label: arbete @sv
type: Concept
narrower: avotyö (vammaisten)