teoriat
preferred label: theories @en
preferred label: teori @sv
type: Concept
narrower: spiritualismi (teologian)

spiritualismi (teologian)
broader generic: teoriat
preferred label: spiritualism (teologi) @en
preferred label: spiritualism @sv
in scheme: conceptscheme
comment: Teologiassa spiritualismi on näkemys, jonka mukaan yhteys Jumalaan on tärkeämpi kuin ulkoinen kirkko, Raamattu ja sakramentit
broader: teoriat
type: Concept
note: Sanalla on monia merkityksiä. 1) Filosofiassa spiritualismi on oppi, jonka mukaan todellisuus on luonteeltaan henkistä. 2) Teologiassa spiritualismi on näkemys, jonka mukaan yhteys Jumalaan on tärkeämpi kuin ulkoinen kirkko, Raamattu ja sakramentit
alternative label: spiritualismi