is
preferred label: ice @en
preferred label: jää @fi
type: Concept
narrower: rimfrost

dimfrost
preferred label: hoar-frost @en
preferred label: huurre @fi
type: Concept
related: rimfrost

rimfrost
related: dimfrost
type: Concept
broader: is
preferred label: kuura @fi
preferred label: hoarfrost @en
comment: pakkasyönä maahan ja kasvien pintaan vesihöyrystä muodostuneet jääkiteet
in scheme: conceptscheme
broader generic: is
source: Kielitoimiston sanakirja