faults
related: disturbances
source: Suomen kielen perussanakirja
preferred label: viat @fi
preferred label: fel (defekt) @sv
type: Concept
broader: internal qualities
broader generic: internal qualities
comment: 1) seikka joka aiheuttaa johonkin epäkuntoisuutta, vajaalaatuisuutta tai vähentää jonkin käyttökelpoisuutta, arvoa tms., häviö, virhe, vioittuma, vaurio; 2) sairaus, häiriö, vamma, vajavuus; 3) ihmisen ominaisuuksista; 4) syy
in scheme: conceptscheme

disturbances
preferred label: störningar @sv
preferred label: häiriöt @fi
type: Concept
related: faults

internal qualities
preferred label: inre egenskaper @sv
preferred label: sisäiset ominaisuudet @fi
type: Concept
narrower: faults