skogsgräns
preferred label: timber line @en
preferred label: metsänraja @fi
in scheme: conceptscheme
related: trädgränsen
type: Concept
source: Kielitoimiston sanakirja
comment: metsän reunavyöhyke, jonka toisella puolella puut eivät kykene muodostamaan yhtenäistä metsää
broader generic: naturformade områden
broader: naturformade områden

naturformade områden
preferred label: areas created by nature @en
preferred label: luonnon muodostamat alueet @fi
type: Concept
narrower: skogsgräns

trädgränsen
preferred label: puuraja @fi
preferred label: timberline @en
type: Concept
related: skogsgräns