international relations
preferred label: kansainväliset suhteet @fi
preferred label: internationella relationer @sv
type: Concept
related: finlandisation

finlandisation
related: international relations
comment: (ilmaus jolla vihjattiin Suomen joutuneen liikaa riippuvaiseksi Neuvostoliitosta:) taipua (Suomen tavoin) myötäilemään Neuvostoliiton politiikkaa itsemääräämisoikeudesta tinkien
preferred label: finlandisering @sv
preferred label: suomettuminen @fi
type: Concept
source: Kielitoimiston sanakirja
broader: social change
in scheme: conceptscheme
broader generic: social change

social change
preferred label: samhällsförändring @sv
preferred label: yhteiskunnallinen muutos @fi
type: Concept
narrower: finlandisation