geologiset kaudet
preferred label: geologiska perioder @sv
preferred label: geological eras @en
type: Concept
related: geokronologia (menetelmät)

kronologia
preferred label: kronologi @sv
preferred label: chronology @en
type: Concept
narrower: geokronologia (menetelmät)

geokronologia (menetelmät)
broader: kronologia
alternative label: geokronologia
type: Concept
related: geologiset kaudet
source: Jukka Korpela
in scheme: conceptscheme
broader generic: kronologia
preferred label: geochronology @en
preferred label: geokronologi (metoder) @sv
comment: tieteenala, joka tutkii maapallon menneisyyden ajoitusta geologisen aineiston perusteella (myös sellaiseen tutkimukseen perustuva ajanjaksoihin jako)