kemialliset ominaisuudet
preferred label: kemiska egenskaper @sv
preferred label: chemical properties @en
type: Concept
narrower: valenssi (kemialliset ominaisuudet)

valenssi (kemialliset ominaisuudet)
type: Concept
preferred label: valens (kemi) @sv
preferred label: valency @en
alternative label: valenssi
broader generic: kemialliset ominaisuudet
comment: kem. alkuaineen atomin kyky sitoutua toisten atomien kanssa yhdisteiksi; sitä kuvaava luku
broader: kemialliset ominaisuudet
source: Kielitoimiston sanakirja
in scheme: conceptscheme