förvandling
preferred label: alteration @en
preferred label: toisenlaiseksi muuttaminen @fi
type: Concept
narrower: reducering

minskning (aktiv reducering av antal)
preferred label: vähentäminen @fi
preferred label: decrease @en
type: Concept
related: reducering

reducering
source: Suomen kielen perussanakirja
preferred label: supistaminen @fi
preferred label: downsizing @en
comment: 1) tehdä (mitoiltaan) pienemmäksi, panna suppuun tai supumpaan, suppeuttaa; 2) pienentää, vähentää, typistää, lyhentää, leikata, rajoittaa, tiivistää, kutistaa
broader: förvandling
broader generic: förvandling
type: Concept
in scheme: conceptscheme
related: minskning (aktiv reducering av antal)