optikot
preferred label: opticians @en
preferred label: optiker @sv
type: Concept
related: optometristit

optometristit
related: optikot
broader: ammatit
note: YSOsama Sama termi kuin YSOssa
comment: näönhuoltoalan määrätutkinnon suorittanut henkilö, joka mm. valmistaa, sovittaa ja huoltaa silmälaseja sekä tekee näöntarkastuksia
type: Concept
broader generic: ammatit
preferred label: optometrists @en
preferred label: optometrister @sv
source: Kielitoimiston sanakirja
in scheme: conceptscheme

ammatit
preferred label: occupations @en
preferred label: yrken @sv
type: Concept
narrower: optometristit