teoriat
preferred label: theories @en
preferred label: teori @sv
type: Concept
narrower: behaviorismi

behaviorismi
source: Kielitoimiston sanakirja
in scheme: conceptscheme
broader: teoriat
preferred label: behaviorism @sv
broader generic: teoriat
type: Concept
comment: psyk. vain ulkoisesti havaittavaa käyttäytymistä tutkiva psykologian suunta