toisenlaiseksi muuttaminen
preferred label: förvandling @sv
preferred label: alteration @en
type: Concept
narrower: voitelu (toisenlaiseksi muuttaminen)

voitelu (toisenlaiseksi muuttaminen)
in scheme: conceptscheme
broader: toisenlaiseksi muuttaminen
comment: sivellä, levittää, hieroa, panna jhk voidetta, sivellä jk voiteella
source: Kielitoimiston sanakirja
preferred label: smörjning (förvandling) @sv
preferred label: lubrication @en
type: Concept
broader generic: toisenlaiseksi muuttaminen
alternative label: voitelu