sosiaalinen konstruktivismi
preferred label: social constructivism @en
preferred label: social konstruktivism @sv
type: Concept
broader generic: konstruktivismi
broader: konstruktivismi

konstruktivismi
preferred label: constructivism @en
preferred label: konstruktivism @sv
broader: aatteet
narrower: sosiaalinen konstruktivismi
comment: Konstruktivismi perustuu käsitykselle oppijasta aktiivisena tiedon muokkaajana sekä käsitykselle itse tiedon dynaamisuudesta. Konstruktivistisen käsityksen mukaan tietoa ei voida sellaisenaan välittää oppijalle, vaan oppija on aktiivinen tiedon konstruoija eli tietorakenteiden muodostaja oppimisprosessissa.
broader generic: aatteet
alternative label: konstruktionismi
type: Concept
in scheme: conceptscheme
source: http://wwwedu.oulu.fi/okl/lo/kt2/wkonstr.htm

aatteet
preferred label: tankar (idéer) @sv
preferred label: ideas @en
type: Concept
narrower: konstruktivismi