Eloviini
type: Concept
broader generic: festivaler
in scheme: conceptscheme
broader: festivaler
comment: Ravintolakoulu Perhon, Vantaan kaupungin sekä kauppakeskus Myyrmannin yhteishankkeena järjestetty karnevaalimainen viinijuhla

festivaler
preferred label: festivals @en
preferred label: festivaalit @fi
type: Concept
narrower: Eloviini