mallit (tehtävä)
preferred label: modeller (människor) @sv
preferred label: models @en
broader: toimintaan liittyvä rooli
source: Suomen kielen perussanakirja
type: Concept
in scheme: conceptscheme
comment: ihmisestä a) kuvataiteilijan aiheenaan käyttämä kohde; b) muotia (vaatteita, koruja tms.) yllään esittelevä henkilö, mannekiini
alternative label: mallit
broader generic: toimintaan liittyvä rooli
related: muotit

muotit
preferred label: formar (mallar) @sv
preferred label: molds @en
type: Concept
related: mallit (tehtävä)

toimintaan liittyvä rooli
preferred label: role related to action @en
preferred label: sysselsättningsrelaterad roll @sv
type: Concept
narrower: mallit (tehtävä)