uskonnolliset tuotokset
preferred label: religiösa alster @sv
preferred label: religious accomplishments @en
type: Concept
narrower: kaanonit (uskonnolliset tuotokset)

kaanonit (uskonnolliset tuotokset)
preferred label: kanon (religiösa alster) @sv
preferred label: canons @en
in scheme: conceptscheme
broader: uskonnolliset tuotokset
source: Lähde: Suomen kielen perussanakirja; CD-Facta
broader generic: uskonnolliset tuotokset
type: Concept
comment: uskonnossa kaanon voi olla pyhien kirjojen kokoelma, kirkolliskokouksen tai paavin säädös, katolisen kirkon pyhimysluettelo tai ortodoksinen liturginen runoelma
note: Sanalla on monia merkityksiä. 1) Uskonnossa kaanon voi olla pyhien kirjojen kokoelma, kirkolliskokouksen tai paavin säädös, katolisen kirkon pyhimysluettelo tai ortodoksinen liturginen runoelma. 2) Kuvataiteissa ihmisruumiin ihanteellisten mittasuhteiden säännöt. 3) Musiikissa moniääninen sävellysmuoto, jossa sama teema alkaa uudessa äänessä ennen kuin se on päättynyt toisessa. 4) Kirjallisuudenhistoriassa yleisesti hyväksytyt teokset. 5) Kirjapainoalalla eräs iso kirjasinkoko
note: Termen har många betydelser. Den används för 1) samling av heliga skrifter 2) musikstycke 3) stor tryckstil 4) centrala verk inom kultur eller konst t.ex. i ett visst land . För artilleripjäs används kanoner. @sv
alternative label: kanonit
alternative label: kaanonit