fenomenologia
type: Concept
source: Yleinen Suomalainen Asiasanasto#fenomenologia
comment: Ilmiöiden elämyksellisyyteen perustuva tutkimus.
broader: filosofia
in scheme: conceptscheme

filosofia
type: Concept
narrower: fenomenologia

fenomenologia
type: Concept
preferred label: fenomenologi @sv