siirtoheittimet
type: Concept
source: Yleinen Suomalainen Asiasanasto#siirtoheittimet
comment: Heijastaa tietokoneen näyttölaitteessa näkyvän tekstin tms. piirtoheittimen tapaan.
broader: audiovisuaalinen laitteisto
in scheme: conceptscheme

audiovisuaalinen laitteisto
type: Concept
narrower: siirtoheittimet

siirtoheittimet
type: Concept
preferred label: data projectors @en
preferred label: projektorplattor @sv