kuvankaappaus
type: Concept
comment: Digitaalisen kuvan kopioimien esim. Internetistä.
broader: kuvantallennus
in scheme: conceptscheme

kuvantallennus
type: Concept
narrower: kuvankaappaus

kuvantallennus
type: Concept
narrower: kuvankaappaus
preferred label: bildinspelning -- teknik @sv