subtraktiivinen värijärjestelmä
type: Concept
comment: Vähentävä värijärjestelmä. Perustuu syaaniin, magentaan ja keltaiseen ja mustaan. Väripigmentistä ja sideaineesta koostuvalla väriaineella vähennetään esim. valkoisesta paperista heijastuvan valon värien määrää.
alternative label: CMYK-järjestelmä
broader: värijärjestelmät (tekniset järjestelmät)
in scheme: conceptscheme

värijärjestelmät (tekniset järjestelmät)
type: Concept
narrower: subtraktiivinen värijärjestelmä