kuvitteellinen liike
type: Concept
comment: Valokuvassa saadaan paikallaan oleviin pintoihin liikeen tuntua erilaisilla muodoilla ja muotojen välisillä eroilla. Kuvitteellista liikettä mudostuu esim. nuolimaisista esineistä.
broader: sisäiset ominaisuudet
in scheme: conceptscheme
related: liike

liike
type: Concept
related: kuvitteellinen liike

sisäiset ominaisuudet
type: Concept
narrower: kuvitteellinen liike