magneettikuvaus
type: Concept
comment: Vars. elimistön sisäisen rakenteen kuvantamismenetelmä, joka perustuu ydinmagneettiseen resonanssiin.
broader: tieteellinen valokuvaus
broader: valokuvaus valoherkille materiaaleille
in scheme: conceptscheme

tieteellinen valokuvaus
type: Concept
narrower: magneettikuvaus

valokuvaus valoherkille materiaaleille
type: Concept
narrower: magneettikuvaus