zoomaus
type: Concept
comment: Kuva-ala rajauksen muuttaminen polttoväliä säätämällä vaihtuvapolttovälisellä objektiivilla.
broader: toisenlaiseksi muuttaminen
in scheme: conceptscheme

toisenlaiseksi muuttaminen
type: Concept
narrower: zoomaus