kameralla seurattu
type: Concept
comment: Kameraa liikutetaan siten, että liikkuvan kohteen kuva pysyy pitkähkön valotuksen aikana samalla kuvaruudun kohdalla. Näin saadaan liikkuvasta kohteesta terävä kuva taustan tullessa epäteräväksi.
broader: terävyysalue
in scheme: conceptscheme

terävyysalue
type: Concept
narrower: kameralla seurattu