additiivinen värijärjestelmä
type: Concept
comment: Lisäävä värijärjestelmä. Punaista, vihreää ja sinistä väriä käyttävä järjestelmä, jossa valoa lisäämällä saadaan muodostettua kaikki muut värit.
alternative label: RGB-järjestelmä
broader: värijärjestelmät (tekniset järjestelmät)
in scheme: conceptscheme
related: oppilastyöt

värijärjestelmät (tekniset järjestelmät)
type: Concept
narrower: additiivinen värijärjestelmä

oppilastyöt
type: Concept
related: additiivinen värijärjestelmä