kalansilmäobjektiivit
type: Concept
comment: Kameran objektiivi, jonka kuvakulma on hyvin laaja (jopa 180 astetta) ja joka piirtää (reunoistaan vääristyneen) joko ympyrämäisen tai suorakaiteen muotoisen kuvan.
broader: laajakulmaobjektiivit
in scheme: conceptscheme

laajakulmaobjektiivit
type: Concept
narrower: kalansilmäobjektiivit