väriherkkyys
type: Concept
narrower: ortokromaattisuus

ortokromaattisuus
type: Concept
comment: Väriherkkyys siniselle ja vihreälle (ei oranssille ja punaiselle).
broader: väriherkkyys
in scheme: conceptscheme