grafiikka
type: Concept
narrower: kuivaneula

kuivaneula
type: Concept
comment: Terävällä piirtimellä syövyttämättä tehty kuparipiirros.
broader: grafiikka
in scheme: conceptscheme

kuivaneula
type: Concept
preferred label: drypoint @en
preferred label: torrnål @sv