valokuvauksen oheisvälineet
type: Concept
narrower: vetämätulkit

vetämätulkit
type: Concept
comment: Kertoo palkeiden venymän vaatiman valotusajan pidennyksen.
broader: valokuvauksen oheisvälineet
in scheme: conceptscheme