atk-laitteet
type: Concept
narrower: CD-polttimet

CD-polttimet
type: Concept
comment: Tietokoneen oheislaite, jolla tallennetaan tietoa CD-ROM-levyille lasersäteellä ”polttamalla”.
broader: atk-laitteet
in scheme: conceptscheme

atk-laitteet
type: Concept
narrower: CD-polttimet
preferred label: computing devices @en
preferred label: datautrustning @sv