toimikortit
type: Concept
broader: tietovälineet
comment: Kortti, jossa tietoja on tallennettu mikroprosessoriin.
alternative label: muistikortit
in scheme: conceptscheme

tietovälineet
type: Concept
narrower: toimikortit

toimikortit
type: Concept
preferred label: intelligent cards @en
preferred label: smarta kort @sv