kamerat
type: Concept
related: loittorenkaat

valokuvausesineistö
type: Concept
narrower: loittorenkaat

loittorenkaat
type: Concept
part of: kamerat
broader: valokuvausesineistö
comment: Renkaita joiden avulla objektiivi voidaan loitontaa kameran rungosta.
related: kamerat
in scheme: conceptscheme