sisäiset ominaisuudet
type: Concept
narrower: koheesio (ominaisuudet)

koheesio (ominaisuudet)
type: Concept
broader: sisäiset ominaisuudet
source: Kielitoimiston sanakirja
comment: sosiol. ryhmän jäsenten välinen yhteenkuuluvuus
alternative label: koheesio
in scheme: conceptscheme
preferred label: kohesion @sv