sommittelu
type: Concept
narrower: poseeraus

poseeraus
broader: sommittelu
comment: Ottaa tav. määrävaikutelmaa tavoitteleva asento ja ilme valokuvaajan tms. mallina.
in scheme: conceptscheme
type: Concept

sommittelu
preferred label: composition, visual arts @en
preferred label: komposition @sv
type: Concept
narrower: poseeraus