konventionalismi
broader: aatteet
comment: Totunnaisuuden seuraaminen, tavanomaisuuteen pyrkiminen.
in scheme: conceptscheme
type: Concept

aatteet
preferred label: ideer @sv
preferred label: ideas @en
type: Concept
narrower: konventionalismi

aatteet
type: Concept
narrower: konventionalismi