koulutus
type: Concept
narrower: jatkokoulutus

jatkokoulutus
preferred label: further education @en
preferred label: vidareutbildning @sv
type: Concept

jatkokoulutus
broader: koulutus
source: Yleinen Suomalainen Asiasanasto#jatkokoulutus
comment: Tarkoittaa ammatti- ja korkeakoulututkinnon jälkeistä usein muodollista pätevyyttä lisäävää koulutusta.
alternative label: lisäkoulutus
in scheme: conceptscheme
type: Concept